Difference between revisions of "Talk:SysCheck GX"

From WiiBrew
Jump to navigation Jump to search
Line 1: Line 1:
 +
== Please Post Compiled Version ==
 
Could someone please include a link to a compiled version?
 
Could someone please include a link to a compiled version?
 
thanks--[[User:Balta|balta]] 18:46, 8 November 2010 (CET)
 
thanks--[[User:Balta|balta]] 18:46, 8 November 2010 (CET)
  
 
:I agree with [[User:Balta|balta]].  It's not that I'm lazy, but it's just the right thing to do. Thanks! '' — [[User:TiMeBoMb|TiMeBoMb]]''  22:07, 9 November 2010 (CET)
 
:I agree with [[User:Balta|balta]].  It's not that I'm lazy, but it's just the right thing to do. Thanks! '' — [[User:TiMeBoMb|TiMeBoMb]]''  22:07, 9 November 2010 (CET)
 +
 +
 +
== Source Won't Compile ==
 +
Just updated to the latest devkitPro, and the source wouldn't compile. '' — [[User:TiMeBoMb|TiMeBoMb]]''  22:29, 9 November 2010 (CET)
 +
        In file included from c:/SysCheck_GX/Source/Main.h:5:0,
 +
                          from c:/SysCheck_GX/Source/Main.cpp:17:
 +
        c:/SysCheck_GX/Source/System/FreeTypeGX.h:30:23: fatal error: ft2build.h: No such file or directory
 +
        compilation terminated.
 +
        make[1]: *** [Main.o] Error 1
 +
        "make": *** [Build] Error 2
 +
       
 +
        > Process Exit Code: 2
 +
        > Time Taken: 00:18

Revision as of 23:29, 9 November 2010

Please Post Compiled Version

Could someone please include a link to a compiled version? thanks--balta 18:46, 8 November 2010 (CET)

I agree with balta. It's not that I'm lazy, but it's just the right thing to do. Thanks! TiMeBoMb 22:07, 9 November 2010 (CET)


Source Won't Compile

Just updated to the latest devkitPro, and the source wouldn't compile. TiMeBoMb 22:29, 9 November 2010 (CET)

        In file included from c:/SysCheck_GX/Source/Main.h:5:0,
                         from c:/SysCheck_GX/Source/Main.cpp:17:
        c:/SysCheck_GX/Source/System/FreeTypeGX.h:30:23: fatal error: ft2build.h: No such file or directory
        compilation terminated.
        make[1]: *** [Main.o] Error 1
        "make": *** [Build] Error 2
        
        > Process Exit Code: 2
        > Time Taken: 00:18